Target
Glycogen debranching enzyme
Ligand
BDBM50263042
Substrate
Meas. Tech.
ChEMBL_490834 (CHEMBL993573)
IC50
6100±n/a nM
Citation
 Kuriyama, CKamiyama, OIkeda, KSanae, FKato, AAdachi, IImahori, TTakahata, HOkamoto, TAsano, N In vitro inhibition of glycogen-degrading enzymes and glycosidases by six-membered sugar mimics and their evaluation in cell cultures. Bioorg Med Chem 16:7330-6 (2008)  
Target
Name:
Glycogen debranching enzyme
Synonyms:
AGL | GDE_RABIT
Type:
PROTEIN
Mol. Mass.:
177662.68
Organism:
Oryctolagus cuniculus
Description:
ChEMBL_490834
Residue:
1555
  
Inhibitor
Name:
BDBM50263042
Synonyms:
7-O-b-D-Glucopyranosyl-a-homonojirimycin | CHEMBL478209
Type:
Small organic molecule
Emp. Form.:
C13H25NO10
Mol. Mass.:
355.3383
SMILES:
OC[C@H]1N[C@H](CO[C@@H]2O[C@H](CO)[C@@H](O)[C@H](O)[C@H]2O)[C@H](O)[C@@H](O)[C@@H]1O
: