Target
Glycogen debranching enzyme
Ligand
BDBM50016703
Substrate
Meas. Tech.
ChEMBL_491004 (CHEMBL982155)
IC50
8400±n/a nM
Citation
 Kuriyama, CKamiyama, OIkeda, KSanae, FKato, AAdachi, IImahori, TTakahata, HOkamoto, TAsano, N In vitro inhibition of glycogen-degrading enzymes and glycosidases by six-membered sugar mimics and their evaluation in cell cultures. Bioorg Med Chem 16:7330-6 (2008)  
Target
Name:
Glycogen debranching enzyme
Synonyms:
AGL GDE_HUMAN
Type:
PROTEIN
Mol. Mass.:
174768.28
Organism:
Homo sapiens (Human)
Description:
ChEMBL_491004
Residue:
1532
  
Inhibitor
Name:
BDBM50016703
Synonyms:
2-Hydroxymethyl-pyrrolidine-3,4-diol CHEMBL80254 | Imino-D-Arabinitol
Type:
Small organic molecule
Emp. Form.:
C5H11NO3
Mol. Mass.:
133.1457
SMILES:
OC[C@H]1NC[C@@H](O)[C@@H]1O
: