Target
Nischarin
Ligand
BDBM50019848
Substrate
Meas. Tech.
ChEMBL_490890 (CHEMBL989166)
Ki
1255±n/a nM
Citation
 Nikolic, KFilipic, SAgbaba, D QSAR study of imidazoline antihypertensive drugs. Bioorg Med Chem 16:7134-40 (2008)  
Target
Name:
Nischarin
Synonyms:
IRAS Imidazoline receptor 1 (I1R) NISCH Nischarin
Type:
Enzyme
Mol. Mass.:
166571.31
Organism:
Homo sapiens (Human)
Description:
Q9Y2I1
Residue:
1504
  
Inhibitor
Name:
BDBM50019848
Synonyms:
2-(2,3-dihydro-1,4-benzodioxin-2-yl)-4,5-dihydro-1H-imidazole CHEMBL10316 US8633208, Idazoxan
Type:
Small organic molecule
Emp. Form.:
C11H12N2O2
Mol. Mass.:
204.2252
SMILES:
C1CN=C(N1)C1COc2ccccc2O1
: