Target
Fatty-acid amide hydrolase 1 [30-579]
Ligand
BDBM50204493
Substrate
Meas. Tech.
ChEMBL_513860 (CHEMBL970754)
IC50
2500±n/a nM
Citation
 Garfunkle, JEzzili, CRayl, TJHochstatter, DGHwang, IBoger, DL Optimization of the central heterocycle of alpha-ketoheterocycle inhibitors of fatty acid amide hydrolase. J Med Chem 51:4392-403 (2008)  
Target
Name:
Fatty-acid amide hydrolase 1 [30-579]
Synonyms:
Anandamide amidohydrolase 1 Faah Fatty Acid Amide Hydrolase Fatty-acid amide hydrolase (FAAH) Fatty-acid amide hydrolase 1 (FAAH) Oleamide hydrolase 1
Type:
Single-pass membrane protein; homodimer
Mol. Mass.:
60474.00
Organism:
Rattus norvegicus (rat)
Description:
P97612 (aa 30-579)
Residue:
550
  
Inhibitor
Name:
BDBM50204493
Synonyms:
1-(oxazol-2-yl)-7-phenylheptan-1-one | CHEMBL220125
Type:
Small organic molecule
Emp. Form.:
C16H19NO2
Mol. Mass.:
257.3276
SMILES:
O=C(CCCCCCc1ccccc1)c1ncco1
: