Target
Adenylate cyclase
Ligand
BDBM50241487
Substrate
Meas. Tech.
ChEMBL_514280 (CHEMBL979110)
IC50
100000±n/a nM
Citation
 Schlicker, CRauch, AHess, KCKachholz, BLevin, LRBuck, JSteegborn, C Structure-based development of novel adenylyl cyclase inhibitors. J Med Chem 51:4456-64 (2008)  
Target
Name:
Adenylate cyclase
Synonyms:
Type:
PROTEIN
Mol. Mass.:
133886.30
Organism:
Spirulina platensis
Description:
ChEMBL_514280
Residue:
1202
  
Inhibitor
Name:
BDBM50241487
Synonyms:
2,3,6,23-tetrahydroxyurs-12-en-28-oic acid CHEMBL404313 | asiantic acid
Type:
Small organic molecule
Emp. Form.:
C30H48O5
Mol. Mass.:
488.6991
SMILES:
C[C@@H]1CC[C@@]2(CC[C@]3(C)C(=CC[C@@H]4[C@@]5(C)C[C@@H](O)[C@H](O)[C@@](C)(CO)[C@@H]5CC[C@@]34C)[C@@H]2[C@H]1C)C(O)=O
: