Target
Ectonucleoside triphosphate diphosphohydrolase 1
Ligand
BDBM50262422
Substrate
Meas. Tech.
ChEMBL_514528 (CHEMBL968882)
Ki
46000±n/a nM
Citation
 Brunschweiger, AIqbal, JUmbach, FScheiff, ABMunkonda, MNSévigny, JKnowles, AFMüller, CE Selective nucleoside triphosphate diphosphohydrolase-2 (NTPDase2) inhibitors: nucleotide mimetics derived from uridine-5'-carboxamide. J Med Chem 51:4518-28 (2008)  
Target
Name:
Ectonucleoside triphosphate diphosphohydrolase 1
Synonyms:
ATPDase Cd39 Ecto-ATP diphosphohydrolase Entpd1 NTPDase 1
Type:
PROTEIN
Mol. Mass.:
57412.31
Organism:
Rattus norvegicus
Description:
ChEMBL_463990
Residue:
511
  
Inhibitor
Name:
BDBM50262422
Synonyms:
CHEMBL477339 | sodium (E)-4-((3-formyl-4-hydroxy-5-methyl-2-(phosphonatooxymethyl)phenyl)diazenyl)benzene-1,3-disulfonate
Type:
Small organic molecule
Emp. Form.:
C15H11N2O12PS2
Mol. Mass.:
506.36
SMILES:
Cc1cc(N=Nc2ccc(cc2S([O-])(=O)=O)S([O-])(=O)=O)c(COP([O-])([O-])=O)c(C=O)c1O
: