Target
Mu-type opioid receptor
Ligand
BDBM50261727
Substrate
Meas. Tech.
ChEMBL_513621 (CHEMBL970712)
Ki
>3670±n/a nM
Citation
 Sakami, SMaeda, MKawai, KAoki, TKawamura, KFujii, HHasebe, KNakajima, MEndo, TUeno, SIto, TKamei, JNagase, H Structure-antitussive activity relationships of naltrindole derivatives. Identification of novel and potent antitussive agents. J Med Chem 51:4404-11 (2008)  
Target
Name:
Mu-type opioid receptor
Synonyms:
M-OR-1 Mu opioid receptor OPIATE Mu OPRM_CAVPO
Type:
Enzyme Catalytic Domain
Mol. Mass.:
11165.58
Organism:
GUINEA PIG
Description:
P97266
Residue:
98
  
Inhibitor
Name:
BDBM50261727
Synonyms:
(5R,9R,13S,14S)-17-Cyclopropylmethyl-6,7-didehydro-4,5-epoxy-3-methoxy-4',5',6',7'-tetradehydro-azepino[3,2,1-hi]indolo[2',1':6,7]morphinan-14-ol | CHEMBL511773
Type:
Small organic molecule
Emp. Form.:
C31H34N2O3
Mol. Mass.:
482.6133
SMILES:
COc1ccc2C[C@H]3N(CC4CC4)CC[C@@]45[C@@H](Oc1c24)c1c(C[C@@]35O)c2cccc3CCCCn1c23
: