Target
Mu-type opioid receptor
Ligand
BDBM50262499
Substrate
Meas. Tech.
ChEMBL_513633 (CHEMBL970724)
Ki
2510±n/a nM
Citation
 Sakami, SMaeda, MKawai, KAoki, TKawamura, KFujii, HHasebe, KNakajima, MEndo, TUeno, SIto, TKamei, JNagase, H Structure-antitussive activity relationships of naltrindole derivatives. Identification of novel and potent antitussive agents. J Med Chem 51:4404-11 (2008)  
Target
Name:
Mu-type opioid receptor
Synonyms:
M-OR-1 Mu opioid receptor OPIATE Mu OPRM_CAVPO
Type:
Enzyme Catalytic Domain
Mol. Mass.:
11165.58
Organism:
GUINEA PIG
Description:
P97266
Residue:
98
  
Inhibitor
Name:
BDBM50262499
Synonyms:
(5R,9R,13S,14S)-17-Cyclopropylmethyl-6,7-didehydro-4,5-epoxy-3-methoxy-indolo[2',3':6,7]morphinan-14-ol CHEMBL514693
Type:
Small organic molecule
Emp. Form.:
C27H28N2O3
Mol. Mass.:
428.5228
SMILES:
COc1ccc2C[C@H]3N(CC4CC4)CC[C@@]45[C@@H](Oc1c24)c1[nH]c2ccccc2c1C[C@@]35O
: