Target
Carbonic anhydrase 5B, mitochondrial
Ligand
BDBM50262062
Substrate
Meas. Tech.
ChEMBL_514689 (CHEMBL976461)
Ki
10.6±n/a nM
Citation
 Poulsen, SAWilkinson, BLInnocenti, AVullo, DSupuran, CT Inhibition of human mitochondrial carbonic anhydrases VA and VB with para-(4-phenyltriazole-1-yl)-benzenesulfonamide derivatives. Bioorg Med Chem Lett 18:4624-7 (2008)  
Target
Name:
Carbonic anhydrase 5B, mitochondrial
Synonyms:
CA-VB CAH5B_HUMAN Carbonic Anhydrase VB Carbonic anhydrase 5B, mitochondrial Carbonic anhydrase V | Carbonic anhydrase VB (CA VB)
Type:
Enzyme
Mol. Mass.:
36440.83
Organism:
Homo sapiens (Human)
Description:
Human (cloned) isozyme
Residue:
317
  
Inhibitor
Name:
BDBM50262062
Synonyms:
4-(4-phenyl-1H-1,2,3-triazol-1-yl)benzenesulfonamide | CHEMBL513184
Type:
Small organic molecule
Emp. Form.:
C14H12N4O2S
Mol. Mass.:
300.336
SMILES:
NS(=O)(=O)c1ccc(cc1)-n1cc(nn1)-c1ccccc1
: