Target
Carbonic anhydrase 5A, mitochondrial
Ligand
BDBM50262067
Substrate
Meas. Tech.
ChEMBL_514688 (CHEMBL976460)
Ki
14.2±n/a nM
Citation
 Poulsen, SAWilkinson, BLInnocenti, AVullo, DSupuran, CT Inhibition of human mitochondrial carbonic anhydrases VA and VB with para-(4-phenyltriazole-1-yl)-benzenesulfonamide derivatives. Bioorg Med Chem Lett 18:4624-7 (2008)  
Target
Name:
Carbonic anhydrase 5A, mitochondrial
Synonyms:
CA-VA CA5A Carbonate dehydratase VA Carbonic anhydrase 5A (CA VA) Carbonic anhydrase 5A, mitochondrial precursor Carbonic anhydrase VA (CA VA)
Type:
Enzyme
Mol. Mass.:
34755.54
Organism:
Homo sapiens (Human)
Description:
Human (cloned) isozyme
Residue:
305
  
Inhibitor
Name:
BDBM50262067
Synonyms:
4-(4-(4-fluorophenyl)-1H-1,2,3-triazol-1-yl)benzenesulfonamide | CHEMBL468367
Type:
Small organic molecule
Emp. Form.:
C14H11FN4O2S
Mol. Mass.:
318.326
SMILES:
NS(=O)(=O)c1ccc(cc1)-n1cc(nn1)-c1ccc(F)cc1
: