Target
Beta-2 adrenergic receptor
Ligand
BDBM50272642
Substrate
Meas. Tech.
ChEMBL_514435 (CHEMBL974622)
EC50
>1000±n/a nM
Citation
 Imanishi, MNakajima, YTomishima, YHamashima, HWashizuka, KSakurai, MMatsui, SImamura, EUeshima, KYamamoto, TYamamoto, NIshikawa, HNakano, KUnami, NHamada, KMatsumura, YTakamura, FHattori, K Discovery of a novel series of benzoic acid derivatives as potent and selective human beta3 adrenergic receptor agonists with good oral bioavailability. 3. Phenylethanolaminotetraline (PEAT) skeleton containing biphenyl or biphenyl ether moiety. J Med Chem 51:4804-22 (2008)  
Target
Name:
Beta-2 adrenergic receptor
Synonyms:
ADRB2 ADRB2_HUMAN Beta-2 adrenoceptor | Beta-2 adrenoreceptor
Type:
Mol. Mass.:
46461.69
Organism:
Homo sapiens (Human)
Description:
P07550
Residue:
413
  
Inhibitor
Name:
BDBM50272642
Synonyms:
5-[((7S)-7-{[(2R)-2-(3-Chlorophenyl)-2-hydroxyethyl]amino}-5,6,7,8-tetrahydro-2-naphthalenyl)oxy]-2-methoxybenzoic Acid | CHEMBL498145
Type:
Small organic molecule
Emp. Form.:
C26H26ClNO5
Mol. Mass.:
467.941
SMILES:
COc1ccc(Oc2ccc3CC[C@@H](Cc3c2)NC[C@H](O)c2cccc(Cl)c2)cc1C(O)=O
: