Target
Beta-3 adrenergic receptor
Ligand
BDBM50273246
Substrate
Meas. Tech.
ChEMBL_514432 (CHEMBL974619)
EC50
2±n/a nM
Citation
 Imanishi, MNakajima, YTomishima, YHamashima, HWashizuka, KSakurai, MMatsui, SImamura, EUeshima, KYamamoto, TYamamoto, NIshikawa, HNakano, KUnami, NHamada, KMatsumura, YTakamura, FHattori, K Discovery of a novel series of benzoic acid derivatives as potent and selective human beta3 adrenergic receptor agonists with good oral bioavailability. 3. Phenylethanolaminotetraline (PEAT) skeleton containing biphenyl or biphenyl ether moiety. J Med Chem 51:4804-22 (2008)  
Target
Name:
Beta-3 adrenergic receptor
Synonyms:
ADRB3 ADRB3_HUMAN Beta-2 adrenergic receptor and beta-3 adrenergic receptor Beta-3 adrenoreceptor | adrenergic Beta3
Type:
G Protein-Coupled Receptor (GPCR)
Mol. Mass.:
43534.88
Organism:
Homo sapiens (Human)
Description:
Residue:
408
  
Inhibitor
Name:
BDBM50273246
Synonyms:
4-((7S)-7-{[(2R)-2-(4-Chlorophenyl)-2-hydroxyethyl]amino}-5,6,7,8-tetrahydro-2-naphthalenyl)-3-methylbenzoic Acid | CHEMBL458927
Type:
Small organic molecule
Emp. Form.:
C26H26ClNO3
Mol. Mass.:
435.943
SMILES:
Cc1cc(ccc1-c1ccc2CC[C@@H](Cc2c1)NC[C@H](O)c1ccc(Cl)cc1)C(O)=O
: