Target
Proto-oncogene tyrosine-protein kinase Src
Ligand
BDBM50042949
Substrate
Meas. Tech.
ChEMBL_510661 (CHEMBL1003141)
IC50
65000±n/a nM
Citation
 Rothweiler, UCzarna, AWeber, LPopowicz, GMBrongel, KKowalska, KOrth, MStemmann, OHolak, TA NMR screening for lead compounds using tryptophan-mutated proteins. J Med Chem 51:5035-42 (2008)  
Target
Name:
Proto-oncogene tyrosine-protein kinase Src
Synonyms:
Calmodulin/Proto-oncogene tyrosine-protein kinase Src Proto-oncogene c-Src SRC SRC_HUMAN V-src sarcoma (Schmidt-Ruppin A-2) viral oncogene homolog (avian) p60-Src | pp60c-src
Type:
Protein
Mol. Mass.:
59838.60
Organism:
Homo sapiens (Human)
Description:
P12931
Residue:
536
  
Inhibitor
Name:
BDBM50042949
Synonyms:
(E)-1-(2,4-dihydroxyphenyl)-3-(3,4-dihydroxyphenyl)-2-propen-1-one (21) (E)-3-(3,4-Dihydroxy-phenyl)-1-(2,4-dihydroxy-phenyl)-propenone 3-(3,4-Dihydroxy-phenyl)-1-(2,4-dihydroxy-phenyl)-propenone CHEMBL128000
Type:
Small organic molecule
Emp. Form.:
C15H12O5
Mol. Mass.:
272.2528
SMILES:
Oc1ccc(C(=O)\C=C\c2ccc(O)c(O)c2)c(O)c1
: