Target
Cannabinoid receptor 1
Ligand
BDBM50272423
Substrate
Meas. Tech.
ChEMBL_510470 (CHEMBL1006411)
Ki
996±n/a nM
Citation
 Pasquini, SBotta, LSemeraro, TMugnaini, CLigresti, APalazzo, EMaione, SDi Marzo, VCorelli, F Investigations on the 4-quinolone-3-carboxylic acid motif. 2. Synthesis and structure-activity relationship of potent and selective cannabinoid-2 receptor agonists endowed with analgesic activity in vivo. J Med Chem 51:5075-84 (2008)  
Target
Name:
Cannabinoid receptor 1
Synonyms:
CANN6 CB-R CNR CNR1_HUMAN Cannabinoid receptor Cannabinoid receptor 1 (brain)
Type:
G Protein-Coupled Receptor (GPCR)
Mol. Mass.:
52868.96
Organism:
Homo sapiens (Human)
Description:
P21554
Residue:
472
  
Inhibitor
Name:
BDBM50272423
Synonyms:
CHEMBL498297 | N-(Adamant-1-yl)-6-bromo-4-oxo-1-pentyl-1,4-dihydroquinoline-3-carboxamide
Type:
Small organic molecule
Emp. Form.:
C25H31BrN2O2
Mol. Mass.:
471.43
SMILES:
CCCCCn1cc(C(=O)NC23CC4CC(CC(C4)C2)C3)c(=O)c2cc(Br)ccc12
: