Target
Cannabinoid receptor 1
Ligand
BDBM50272235
Substrate
Meas. Tech.
ChEMBL_510479 (CHEMBL1006420)
EC50
>1000±n/a nM
Citation
 Cheng, YAlbrecht, BKBrown, JBuchanan, JLBuckner, WHDiMauro, EFEmkey, RFremeau, RTHarmange, JCHoffman, BJHuang, LHuang, MLee, JHLin, FFMartin, MWNguyen, HQPatel, VFTomlinson, SAWhite, RDXia, XHitchcock, SA Discovery and optimization of a novel series of N-arylamide oxadiazoles as potent, highly selective and orally bioavailable cannabinoid receptor 2 (CB2) agonists. J Med Chem 51:5019-34 (2008)  
Target
Name:
Cannabinoid receptor 1
Synonyms:
CANN6 CB-R CNR CNR1_HUMAN Cannabinoid receptor Cannabinoid receptor 1 (brain)
Type:
G Protein-Coupled Receptor (GPCR)
Mol. Mass.:
52868.96
Organism:
Homo sapiens (Human)
Description:
P21554
Residue:
472
  
Inhibitor
Name:
BDBM50272235
Synonyms:
3-(3-(3-Cyanopyridin-4-yl)-1,2,4-oxadiazol-5-yl)-N-(9-ethyl-9Hcarbazol-3-yl)propanamide | CHEMBL499601
Type:
Small organic molecule
Emp. Form.:
C25H20N6O2
Mol. Mass.:
436.4653
SMILES:
CCn1c2ccccc2c2cc(NC(=O)CCc3nc(no3)-c3ccncc3C#N)ccc12
: