Target
Cannabinoid receptor 1
Ligand
BDBM50272232
Substrate
Meas. Tech.
ChEMBL_510475 (CHEMBL1006416)
EC50
1200±n/a nM
Citation
 Cheng, YAlbrecht, BKBrown, JBuchanan, JLBuckner, WHDiMauro, EFEmkey, RFremeau, RTHarmange, JCHoffman, BJHuang, LHuang, MLee, JHLin, FFMartin, MWNguyen, HQPatel, VFTomlinson, SAWhite, RDXia, XHitchcock, SA Discovery and optimization of a novel series of N-arylamide oxadiazoles as potent, highly selective and orally bioavailable cannabinoid receptor 2 (CB2) agonists. J Med Chem 51:5019-34 (2008)  
Target
Name:
Cannabinoid receptor 1
Synonyms:
CANN6 CB-R CNR CNR1_HUMAN Cannabinoid receptor Cannabinoid receptor 1 (brain)
Type:
G Protein-Coupled Receptor (GPCR)
Mol. Mass.:
52868.96
Organism:
Homo sapiens (Human)
Description:
P21554
Residue:
472
  
Inhibitor
Name:
BDBM50272232
Synonyms:
3-(3-(2-Chloro-4-fluorophenyl)-1,2,4-oxadiazol-5-yl)-N-(9-ethyl-9H-carbazol-3-yl)propanamide | CHEMBL527095
Type:
Small organic molecule
Emp. Form.:
C25H20ClFN4O2
Mol. Mass.:
462.903
SMILES:
CCn1c2ccccc2c2cc(NC(=O)CCc3nc(no3)-c3ccc(F)cc3Cl)ccc12
: