Target
Cannabinoid receptor 2
Ligand
BDBM50272174
Substrate
Meas. Tech.
ChEMBL_510476 (CHEMBL1006417)
EC50
410±n/a nM
Citation
 Cheng, YAlbrecht, BKBrown, JBuchanan, JLBuckner, WHDiMauro, EFEmkey, RFremeau, RTHarmange, JCHoffman, BJHuang, LHuang, MLee, JHLin, FFMartin, MWNguyen, HQPatel, VFTomlinson, SAWhite, RDXia, XHitchcock, SA Discovery and optimization of a novel series of N-arylamide oxadiazoles as potent, highly selective and orally bioavailable cannabinoid receptor 2 (CB2) agonists. J Med Chem 51:5019-34 (2008)  
Target
Name:
Cannabinoid receptor 2
Synonyms:
CANNABINOID CB2 CB2 CB2B CNR2_HUMAN Cannabinoid CB2 receptor Cannabinoid receptor 2 (CB2R) | hCB2
Type:
G Protein-Coupled Receptor (GPCR)
Mol. Mass.:
39690.94
Organism:
Homo sapiens (Human)
Description:
P34972
Residue:
360
  
Inhibitor
Name:
BDBM50272174
Synonyms:
3-(3-(3-Chlorophenyl)-1,2,4-oxadiazol-5-yl)-N-(9-ethyl-9H-carbazol-3-yl)propanamide | CHEMBL499627
Type:
Small organic molecule
Emp. Form.:
C25H21ClN4O2
Mol. Mass.:
444.913
SMILES:
CCn1c2ccccc2c2cc(NC(=O)CCc3nc(no3)-c3cccc(Cl)c3)ccc12
: