Target
Glucocorticoid receptor
Ligand
BDBM50004233
Substrate
Meas. Tech.
ChEMBL_555519 (CHEMBL963779)
IC50
90000±n/a nM
Citation
 Carroll, ARAddepalli, RFechner, GSmith, JGuymer, GPForster, PIQuinn, RJ Alkaloids from the Australian rainforest tree Ochrosia moorei. J Nat Prod 71:1063-5 (2008)  
Target
Name:
Glucocorticoid receptor
Synonyms:
GCR_HUMAN GRL Glucocorticoid receptor (GRFP) Nuclear receptor subfamily 3 group C member 1
Type:
Enzyme
Mol. Mass.:
85656.87
Organism:
Homo sapiens (Human)
Description:
P04150
Residue:
777
  
Inhibitor
Name:
BDBM50004233
Synonyms:
5,11-dimethyl-2H-pyrido[4,3-b]carbazole ELLIPTECINE Ellipticine cid_3213
Type:
Small organic molecule
Emp. Form.:
C17H14N2
Mol. Mass.:
246.3065
SMILES:
Cc1c2[nH]c3ccccc3c2c(C)c2cnccc12
: