Target
Gamma-aminobutyric acid receptor subunit alpha-3
Ligand
BDBM50049736
Substrate
Meas. Tech.
ChEMBL_491123 (CHEMBL991891)
Ki
18.7±n/a nM
Citation
 Harris, DClayton, TCook, JSahbaie, PHalliwell, RFFurtmüller, RHuck, SSieghart, WDeLorey, TM Selective influence on contextual memory: physiochemical properties associated with selectivity of benzodiazepine ligands at GABAA receptors containing the alpha5 subunit. J Med Chem 51:3788-803 (2008)  
Target
Name:
Gamma-aminobutyric acid receptor subunit alpha-3
Synonyms:
GABA A Alpha3Beta3Gamma2 GABA C GABA-A receptor GBRA3_HUMAN agonist GABA site
Type:
Enzyme Catalytic Domain
Mol. Mass.:
55175.47
Organism:
Homo sapiens (Human)
Description:
GABA A Alpha3Beta1Gamma2 0 HUMAN::P34903
Residue:
492
  
Inhibitor
Name:
BDBM50049736
Synonyms:
8-Ethynyl-5-methyl-6-oxo-5,6-dihydro-4H-2,5,10b-triaza-benzo[e]azulene-3-carboxylic acid tert-butyl ester CHEMBL58757
Type:
Small organic molecule
Emp. Form.:
C19H19N3O3
Mol. Mass.:
337.3725
SMILES:
CN1Cc2c(ncn2-c2ccc(cc2C1=O)C#C)C(=O)OC(C)(C)C
: