Target
Gamma-aminobutyric acid receptor subunit alpha-3
Ligand
BDBM50034820
Substrate
Meas. Tech.
ChEMBL_491123 (CHEMBL991891)
Ki
>300±n/a nM
Citation
 Harris, DClayton, TCook, JSahbaie, PHalliwell, RFFurtmüller, RHuck, SSieghart, WDeLorey, TM Selective influence on contextual memory: physiochemical properties associated with selectivity of benzodiazepine ligands at GABAA receptors containing the alpha5 subunit. J Med Chem 51:3788-803 (2008)  
Target
Name:
Gamma-aminobutyric acid receptor subunit alpha-3
Synonyms:
GABA A Alpha3Beta3Gamma2 GABA C GABA-A receptor GBRA3_HUMAN agonist GABA site
Type:
Enzyme Catalytic Domain
Mol. Mass.:
55175.47
Organism:
Homo sapiens (Human)
Description:
GABA A Alpha3Beta1Gamma2 0 HUMAN::P34903
Residue:
492
  
Inhibitor
Name:
BDBM50034820
Synonyms:
8-Chloro-3-methoxymethyl-5-methyl-4,5-dihydro-2,5,10b-triaza-benzo[e]azulen-6-one | CHEMBL45346
Type:
Small organic molecule
Emp. Form.:
C14H14ClN3O2
Mol. Mass.:
291.733
SMILES:
COCc1ncn-2c1CN(C)C(=O)c1cc(Cl)ccc-21
: