Target
Gamma-aminobutyric acid receptor subunit alpha-1
Ligand
BDBM25878
Substrate
Meas. Tech.
ChEMBL_491118 (CHEMBL991886)
Kd
4.5±n/a nM
Citation
 Harris, DClayton, TCook, JSahbaie, PHalliwell, RFFurtmüller, RHuck, SSieghart, WDeLorey, TM Selective influence on contextual memory: physiochemical properties associated with selectivity of benzodiazepine ligands at GABAA receptors containing the alpha5 subunit. J Med Chem 51:3788-803 (2008)  
Target
Name:
Gamma-aminobutyric acid receptor subunit alpha-1
Synonyms:
Benzodiazepine central GABA A Benzodiazepine liver GABA(A) receptor subunit alpha-1 GABA-A receptor GBRA1_HUMAN TBPS | agonist GABA site
Type:
Protein
Mol. Mass.:
51817.35
Organism:
Homo sapiens (Human)
Description:
P14867
Residue:
456
  
Inhibitor
Name:
BDBM25878
Synonyms:
5-(2-fluorophenyl)-1-methyl-7-nitro-2,3-dihydro-1H-1,4-benzodiazepin-2-one Flunitrazepam [3H]flunitrazepam
Type:
radiolabeled ligand
Emp. Form.:
C16H12FN3O3
Mol. Mass.:
313.2832
SMILES:
CN1c2ccc(cc2C(=NCC1=O)c1ccccc1F)[N+]([O-])=O
: