Target
Gamma-aminobutyric acid receptor subunit alpha-1
Ligand
BDBM50244118
Substrate
Meas. Tech.
ChEMBL_491118 (CHEMBL991886)
Kd
200±n/a nM
Citation
 Harris, DClayton, TCook, JSahbaie, PHalliwell, RFFurtmüller, RHuck, SSieghart, WDeLorey, TM Selective influence on contextual memory: physiochemical properties associated with selectivity of benzodiazepine ligands at GABAA receptors containing the alpha5 subunit. J Med Chem 51:3788-803 (2008)  
Target
Name:
Gamma-aminobutyric acid receptor subunit alpha-1
Synonyms:
Benzodiazepine central GABA A Benzodiazepine liver GABA(A) receptor subunit alpha-1 GABA-A receptor GBRA1_HUMAN TBPS | agonist GABA site
Type:
Protein
Mol. Mass.:
51817.35
Organism:
Homo sapiens (Human)
Description:
P14867
Residue:
456
  
Inhibitor
Name:
BDBM50244118
Synonyms:
CHEMBL518197 | ethyl 12-oxo-15-[2-(trimethylsilyl)ethynyl]-2,4,11-triazatetracyclo[11.4.0.0^{2,6}.0^{7,11}]heptadeca-1(17),3,5,13,15-pentaene-5-carboxylate
Type:
Small organic molecule
Emp. Form.:
C22H25N3O3Si
Mol. Mass.:
407.5377
SMILES:
CCOC(=O)c1ncn-2c1C1CCCN1C(=O)c1cc(ccc-21)C#C[Si](C)(C)C
: