Target
Gamma-aminobutyric acid receptor subunit alpha-1
Ligand
BDBM50244192
Substrate
Meas. Tech.
ChEMBL_491120 (CHEMBL991888)
IC50
1000±n/a nM
Citation
 Harris, DClayton, TCook, JSahbaie, PHalliwell, RFFurtmüller, RHuck, SSieghart, WDeLorey, TM Selective influence on contextual memory: physiochemical properties associated with selectivity of benzodiazepine ligands at GABAA receptors containing the alpha5 subunit. J Med Chem 51:3788-803 (2008)  
Target
Name:
Gamma-aminobutyric acid receptor subunit alpha-1
Synonyms:
Benzodiazepine central GABA A Benzodiazepine liver GABA(A) receptor subunit alpha-1 GABA-A receptor GBRA1_HUMAN TBPS | agonist GABA site
Type:
Protein
Mol. Mass.:
51817.35
Organism:
Homo sapiens (Human)
Description:
P14867
Residue:
456
  
Inhibitor
Name:
BDBM50244192
Synonyms:
(3-aminobenzo[b]thiophen-2-yl)(4-chlorophenyl)methanone | CHEMBL461925
Type:
Small organic molecule
Emp. Form.:
C15H10ClNOS
Mol. Mass.:
287.764
SMILES:
Nc1c(sc2ccccc12)C(=O)c1ccc(Cl)cc1
: