Target
Sucrase-isomaltase, intestinal
Ligand
BDBM50242818
Substrate
Meas. Tech.
ChEMBL_491530 (CHEMBL937800)
Ki
52±n/a nM
Citation
 Ozaki, SOe, HKitamura, S Alpha-glucosidase inhibitor from Kothala-himbutu (Salacia reticulata WIGHT). J Nat Prod 71:981-4 (2008)  
Target
Name:
Sucrase-isomaltase, intestinal
Synonyms:
SUIS_RAT Sucrase-isomaltase | alpha-Glucosidase (α-Glucosidase)
Type:
Enzyme
Mol. Mass.:
210329.04
Organism:
Rattus norvegicus (Rat)
Description:
P23739
Residue:
1841
  
Inhibitor
Name:
BDBM50242818
Synonyms:
1-Oxo-1lambda-4-thia-cyclotridecan-3,4,5,6,8,10,11,12-octaol | CHEMBL460255
Type:
Small organic molecule
Emp. Form.:
C12H24O9S
Mol. Mass.:
344.379
SMILES:
OC1CC(O)C(O)C(O)CS(=O)CC(O)C(O)C(O)C(O)C1
: