Target
B1 bradykinin receptor
Ligand
BDBM50243117
Substrate
Meas. Tech.
ChEMBL_487377 (CHEMBL1021904)
Ki
>10000±n/a nM
Citation
 Su, DSLim, JLTinney, EWan, BLMurphy, KLReiss, DRHarrell, CMO'Malley, SSRansom, RWChang, RSPettibone, DJYu, JTang, CPrueksaritanont, TFreidinger, RMBock, MGAnthony, NJ 2-Aminobenzophenones as a novel class of bradykinin B1 receptor antagonists. J Med Chem 51:3946-52 (2008)  
Target
Name:
B1 bradykinin receptor
Synonyms:
B1 BRADYKININ B1R BK-1 receptor BRADYB1 | Bradykinin B1 receptor
Type:
Enzyme
Mol. Mass.:
40508.87
Organism:
Homo sapiens (Human)
Description:
P46663
Residue:
353
  
Inhibitor
Name:
BDBM50243117
Synonyms:
CHEMBL528544 | Methyl (4-{[(2-Benzoylphenyl)amino]sulfonyl}phenyl)carbamate
Type:
Small organic molecule
Emp. Form.:
C21H18N2O5S
Mol. Mass.:
410.443
SMILES:
COC(=O)Nc1ccc(cc1)S(=O)(=O)Nc1ccccc1C(=O)c1ccccc1
: