Target
B1 bradykinin receptor
Ligand
BDBM50243115
Substrate
Meas. Tech.
ChEMBL_487377 (CHEMBL1021904)
Ki
24±n/a nM
Citation
 Su, DSLim, JLTinney, EWan, BLMurphy, KLReiss, DRHarrell, CMO'Malley, SSRansom, RWChang, RSPettibone, DJYu, JTang, CPrueksaritanont, TFreidinger, RMBock, MGAnthony, NJ 2-Aminobenzophenones as a novel class of bradykinin B1 receptor antagonists. J Med Chem 51:3946-52 (2008)  
Target
Name:
B1 bradykinin receptor
Synonyms:
B1 BRADYKININ B1R BK-1 receptor BRADYB1 | Bradykinin B1 receptor
Type:
Enzyme
Mol. Mass.:
40508.87
Organism:
Homo sapiens (Human)
Description:
P46663
Residue:
353
  
Inhibitor
Name:
BDBM50243115
Synonyms:
CHEMBL530549 | N-{4-[({2-[(5-Fluoropyridin-2-yl)carbonyl]phenyl}amino)sulfonyl]phenyl}acetamide
Type:
Small organic molecule
Emp. Form.:
C20H16FN3O4S
Mol. Mass.:
413.422
SMILES:
CC(=O)Nc1ccc(cc1)S(=O)(=O)Nc1ccccc1C(=O)c1ccc(F)cn1
: