Target
5-hydroxytryptamine receptor 2A
Ligand
BDBM50263947
Substrate
Meas. Tech.
ChEMBL_535414 (CHEMBL984443)
Ki
166±n/a nM
Citation
 Strappaghetti, GMastrini, LLucacchini, AGiannaccini, GBetti, LFabbrini, L Synthesis and biological affinity of new imidazo- and indol-arylpiperazine derivatives: further validation of a pharmacophore model for alpha(1)-adrenoceptor antagonists. Bioorg Med Chem Lett 18:5140-5 (2008)  
Target
Name:
5-hydroxytryptamine receptor 2A
Synonyms:
5-HT-2 5-HT2A 5-hydroxytryptamine receptor 2A (5HT-2A) 5HT2A_HUMAN HTR2A | Serotonin receptor 2A
Type:
undefined
Mol. Mass.:
52607.65
Organism:
Homo sapiens (Human)
Description:
P28223
Residue:
471
  
Inhibitor
Name:
BDBM50263947
Synonyms:
6-(1H-imidazol-1-yl)-2-(4-(4-(3-(trifluoromethyl)phenyl)piperazin-1-yl)butyl)pyridazin-3(2H)-one | CHEMBL489582
Type:
Small organic molecule
Emp. Form.:
C22H25F3N6O
Mol. Mass.:
446.4687
SMILES:
FC(F)(F)c1cccc(c1)N1CCN(CCCCn2nc(ccc2=O)-n2ccnc2)CC1
: