Target
Thrombopoietin receptor
Ligand
BDBM50264079
Substrate
Meas. Tech.
ChEMBL_535587 (CHEMBL987061)
EC50
194±n/a nM
Citation
 Alper, PBMarsilje, THMutnick, DLu, WChatterjee, ARoberts, MJHe, YKaranewsky, DSChow, DLao, JGerken, ATuntland, TLiu, BChang, JGordon, PSeidel, HMTian, SS Discovery and biological evaluation of benzo[a]carbazole-based small molecule agonists of the thrombopoietin (Tpo) receptor. Bioorg Med Chem Lett 18:5255-8 (2008)  
Target
Name:
Thrombopoietin receptor
Synonyms:
C-mpl MPL TPO-R TPOR_HUMAN
Type:
PROTEIN
Mol. Mass.:
71243.48
Organism:
Homo sapiens (Human)
Description:
ChEMBL_535587
Residue:
635
  
Inhibitor
Name:
BDBM50264079
Synonyms:
2-hydroxy-9-m-tolyl-6,11-dihydro-5H-benzo[a]carbazole-3-carboxylic acid | CHEMBL521746
Type:
Small organic molecule
Emp. Form.:
C24H19NO3
Mol. Mass.:
369.4126
SMILES:
Cc1cccc(c1)-c1ccc2c3CCc4cc(C(O)=O)c(O)cc4-c3[nH]c2c1
: