Target
5-hydroxytryptamine receptor 2A
Ligand
BDBM50014990
Substrate
Meas. Tech.
ChEMBL_537763 (CHEMBL994216)
Ki
10±n/a nM
Citation
 Runyon, SPMosier, PDRoth, BLGlennon, RAWestkaemper, RB Potential modes of interaction of 9-aminomethyl-9,10-dihydroanthracene (AMDA) derivatives with the 5-HT2A receptor: a ligand structure-affinity relationship, receptor mutagenesis and receptor modeling investigation. J Med Chem 51:6808-28 (2008)  
Target
Name:
5-hydroxytryptamine receptor 2A
Synonyms:
5-HT-2 5-HT2A 5-hydroxytryptamine receptor 2A (5HT-2A) 5HT2A_HUMAN HTR2A | Serotonin receptor 2A
Type:
undefined
Mol. Mass.:
52607.65
Organism:
Homo sapiens (Human)
Description:
P28223
Residue:
471
  
Inhibitor
Name:
BDBM50014990
Synonyms:
1-(2,5-dimethoxy-4-(3-phenylpropyl)phenyl)propan-2-amine CHEMBL8334
Type:
Small organic molecule
Emp. Form.:
C20H27NO2
Mol. Mass.:
313.4339
SMILES:
COc1cc(CC(C)N)c(OC)cc1CCCc1ccccc1
: