Target
Galectin-1
Ligand
BDBM50273431
Substrate
Meas. Tech.
ChEMBL_560904 (CHEMBL1013539)
Kd
4400±n/a nM
Citation
 Delaine, TCumpstey, IIngrassia, LLe Mercier, MOkechukwu, PLeffler, HKiss, RNilsson, UJ Galectin-inhibitory thiodigalactoside ester derivatives have antimigratory effects in cultured lung and prostate cancer cells. J Med Chem 51:8109-14 (2008)  
Target
Name:
Galectin-1
Synonyms:
14 kDa lectin HPL LGALS1 Lectin galactoside-binding soluble 1 | Putative MAPK-activating protein PM12
Type:
beta galactoside-binding protein
Mol. Mass.:
14713.53
Organism:
Homo sapiens (Human)
Description:
P09382
Residue:
135
  
Inhibitor
Name:
BDBM50273431
Synonyms:
Bis-[3-O-(3-methoxybenzoyl)-beta-D-galactopyranosyl]sulfane | CHEMBL509915
Type:
Small organic molecule
Emp. Form.:
C28H34O14S
Mol. Mass.:
626.626
SMILES:
COc1cccc(c1)C(=O)O[C@H]1[C@@H](O)[C@@H](CO)O[C@@H](S[C@@H]2O[C@H](CO)[C@H](O)[C@H](OC(=O)c3cccc(OC)c3)[C@H]2O)[C@@H]1O
: