Target
Galectin-3
Ligand
BDBM50273430
Substrate
Meas. Tech.
ChEMBL_560905 (CHEMBL1013540)
Kd
1600±n/a nM
Citation
 Delaine, TCumpstey, IIngrassia, LLe Mercier, MOkechukwu, PLeffler, HKiss, RNilsson, UJ Galectin-inhibitory thiodigalactoside ester derivatives have antimigratory effects in cultured lung and prostate cancer cells. J Med Chem 51:8109-14 (2008)  
Target
Name:
Galectin-3
Synonyms:
LEG3_HUMAN MAC2
Type:
Enzyme
Mol. Mass.:
26156.54
Organism:
Homo sapiens (Human)
Description:
P17931
Residue:
250
  
Inhibitor
Name:
BDBM50273430
Synonyms:
Bis-(3-O-benzoyl-beta-D-galactopyranosyl)sulfane | CHEMBL458489
Type:
Small organic molecule
Emp. Form.:
C26H30O12S
Mol. Mass.:
566.574
SMILES:
OC[C@H]1O[C@@H](S[C@@H]2O[C@H](CO)[C@H](O)[C@H](OC(=O)c3ccccc3)[C@H]2O)[C@H](O)[C@@H](OC(=O)c2ccccc2)[C@H]1O
: