Target
Galectin-3
Ligand
BDBM50273582
Substrate
Meas. Tech.
ChEMBL_560905 (CHEMBL1013540)
Kd
4400±n/a nM
Citation
 Delaine, TCumpstey, IIngrassia, LLe Mercier, MOkechukwu, PLeffler, HKiss, RNilsson, UJ Galectin-inhibitory thiodigalactoside ester derivatives have antimigratory effects in cultured lung and prostate cancer cells. J Med Chem 51:8109-14 (2008)  
Target
Name:
Galectin-3
Synonyms:
LEG3_HUMAN MAC2
Type:
Enzyme
Mol. Mass.:
26156.54
Organism:
Homo sapiens (Human)
Description:
P17931
Residue:
250
  
Inhibitor
Name:
BDBM50273582
Synonyms:
CHEMBL516152 | N-((2S,3R,4S,5R,6R)-2-((2R,3S,4R,5R,6R)-5-acetamido-4-hydroxy-2-(hydroxymethyl)-6-methoxy-tetrahydro-2H-pyran-3-yloxy)-3,5-dihydroxy-6-(hydroxymethyl)-tetrahydro-2H-pyran-4-yl)-1-naphthamide
Type:
Small organic molecule
Emp. Form.:
C26H34N2O11
Mol. Mass.:
550.555
SMILES:
CO[C@@H]1O[C@H](CO)[C@@H](O[C@@H]2O[C@H](CO)[C@H](O)[C@H](NC(=O)c3cccc4ccccc34)[C@H]2O)[C@H](O)[C@H]1NC(C)=O
: