Target
Galectin-1
Ligand
BDBM50273580
Substrate
Meas. Tech.
ChEMBL_560906 (CHEMBL1013541)
Kd
2000±n/a nM
Citation
 Delaine, TCumpstey, IIngrassia, LLe Mercier, MOkechukwu, PLeffler, HKiss, RNilsson, UJ Galectin-inhibitory thiodigalactoside ester derivatives have antimigratory effects in cultured lung and prostate cancer cells. J Med Chem 51:8109-14 (2008)  
Target
Name:
Galectin-1
Synonyms:
14 kDa lectin HPL LGALS1 Lectin galactoside-binding soluble 1 | Putative MAPK-activating protein PM12
Type:
beta galactoside-binding protein
Mol. Mass.:
14713.53
Organism:
Homo sapiens (Human)
Description:
P09382
Residue:
135
  
Inhibitor
Name:
BDBM50273580
Synonyms:
CHEMBL503116 | N-[(2S,3R,4S,5R,6R)-2-{[(2S,3R,4S,5R,6R)-3,5-dihydroxy-6-(hydroxymethyl)-4-[(3-methoxybenzene)amido]oxan-2-yl]sulfanyl}-3,5-dihydroxy-6-(hydroxymethyl)oxan-4-yl]-3-methoxybenzamide
Type:
Small organic molecule
Emp. Form.:
C28H36N2O12S
Mol. Mass.:
624.657
SMILES:
COc1cccc(c1)C(=O)N[C@H]1[C@@H](O)[C@@H](CO)O[C@@H](S[C@@H]2O[C@H](CO)[C@H](O)[C@H](NC(=O)c3cccc(OC)c3)[C@H]2O)[C@@H]1O
: