Target
Galectin-8
Ligand
BDBM50077225
Substrate
Meas. Tech.
ChEMBL_560907 (CHEMBL1013542)
Kd
61000±n/a nM
Citation
 Delaine, TCumpstey, IIngrassia, LLe Mercier, MOkechukwu, PLeffler, HKiss, RNilsson, UJ Galectin-inhibitory thiodigalactoside ester derivatives have antimigratory effects in cultured lung and prostate cancer cells. J Med Chem 51:8109-14 (2008)  
Target
Name:
Galectin-8
Synonyms:
Gal-8 LGALS8 Po66 carbohydrate-binding protein Prostate carcinoma tumor antigen 1
Type:
PROTEIN
Mol. Mass.:
35814.23
Organism:
Homo sapiens (Human)
Description:
ChEMBL_1454625
Residue:
317
  
Inhibitor
Name:
BDBM50077225
Synonyms:
(2R,3R,4S,5R,6S)-2-(hydroxymethyl)-6-{[(2S,3R,4S,5R,6R)-3,4,5-trihydroxy-6-(hydroxymethyl)tetrahydro-2H-pyran-2-yl]thio}tetrahydro-2H-pyran-3,4,5-triol THIODIGALACTOSIDE
Type:
Small organic molecule
Emp. Form.:
C12H22O10S
Mol. Mass.:
358.362
SMILES:
OC[C@H]1O[C@@H](S[C@@H]2O[C@H](CO)[C@H](O)[C@H](O)[C@H]2O)[C@H](O)[C@@H](O)[C@H]1O
: