Target
Purine nucleoside phosphorylase
Ligand
BDBM50247149
Substrate
Meas. Tech.
ChEMBL_557942 (CHEMBL963040)
Ki
101±n/a nM
Citation
 Murkin, ASClinch, KMason, JMTyler, PCSchramm, VL Immucillins in custom catalytic-site cavities. Bioorg Med Chem Lett 18:5900-3 (2008)  
Target
Name:
Purine nucleoside phosphorylase
Synonyms:
Inosine phosphorylase NP PNPH_HUMAN | Purine nucleoside phosphorylase (PNPase)
Type:
Enzyme
Mol. Mass.:
32119.53
Organism:
Homo sapiens (Human)
Description:
Residue:
289
  
Inhibitor
Name:
BDBM50247149
Synonyms:
5'-Methylthio-ImmH US9290501, (A)
Type:
Small organic molecule
Emp. Form.:
C12H16N4O3S
Mol. Mass.:
296.345
SMILES:
CSC[C@H]1N[C@H]([C@H](O)[C@@H]1O)c1c[nH]c2c1nc[nH]c2=O
: