Target
Metabotropic glutamate receptor 4
Ligand
BDBM50254337
Substrate
Meas. Tech.
ChEMBL_559521 (CHEMBL1018994)
Ki
>1000000±n/a nM
Citation
 Filosa, RCarmela Fulco, MMarinozzi, MGiacchè, NMacchiarulo, APeduto, AMassa, Ade Caprariis, PThomsen, CChristoffersen, CTPellicciari, R Design, synthesis and biological evaluation of novel bicyclo[1.1.1]pentane-based omega-acidic amino acids as glutamate receptors ligands. Bioorg Med Chem 17:242-50 (2008)  
Target
Name:
Metabotropic glutamate receptor 4
Synonyms:
GPRC1D GRM4_HUMAN MGLUR4 Metabotropic glutamate receptor 4 (mGlu4) metabotropic glutamate 4
Type:
Protein
Mol. Mass.:
101899.95
Organism:
Homo sapiens (Human)
Description:
Q14833
Residue:
912
  
Inhibitor
Name:
BDBM50254337
Synonyms:
(2S)-3-(3'-Carboxybicyclo[1.1.1]pentyl)alanine | CHEMBL444718
Type:
Small organic molecule
Emp. Form.:
C9H13NO4
Mol. Mass.:
199.2038
SMILES:
N[C@@H](CC12CC(C1)(C2)C(O)=O)C(O)=O
: