Target
Metabotropic glutamate receptor 4
Ligand
BDBM17657
Substrate
Meas. Tech.
ChEMBL_559521 (CHEMBL1018994)
Ki
1400±n/a nM
Citation
 Filosa, RCarmela Fulco, MMarinozzi, MGiacchè, NMacchiarulo, APeduto, AMassa, Ade Caprariis, PThomsen, CChristoffersen, CTPellicciari, R Design, synthesis and biological evaluation of novel bicyclo[1.1.1]pentane-based omega-acidic amino acids as glutamate receptors ligands. Bioorg Med Chem 17:242-50 (2008)  
Target
Name:
Metabotropic glutamate receptor 4
Synonyms:
GPRC1D GRM4_HUMAN MGLUR4 Metabotropic glutamate receptor 4 (mGlu4) metabotropic glutamate 4
Type:
Protein
Mol. Mass.:
101899.95
Organism:
Homo sapiens (Human)
Description:
Q14833
Residue:
912
  
Inhibitor
Name:
BDBM17657
Synonyms:
(2S)-2-aminopentanedioic acid D-Glutamate L-Glu L-Glutamic acid L-gluatmate
Type:
Amino Acid
Emp. Form.:
C5H9NO4
Mol. Mass.:
147.1293
SMILES:
N[C@@H](CCC(O)=O)C(O)=O
: