Target
Cannabinoid receptor 1
Ligand
BDBM50265642
Substrate
Meas. Tech.
ChEMBL_560424 (CHEMBL1015427)
EC50
>10000±n/a nM
Citation
 Diaz, PPhatak, SSXu, JAstruc-Diaz, FCavasotto, CNNaguib, M 6-Methoxy-N-alkyl isatin acylhydrazone derivatives as a novel series of potent selective cannabinoid receptor 2 inverse agonists: design, synthesis, and binding mode prediction. J Med Chem 52:433-44 (2009)  
Target
Name:
Cannabinoid receptor 1
Synonyms:
CANN6 CB-R CNR CNR1_HUMAN Cannabinoid receptor Cannabinoid receptor 1 (brain)
Type:
G Protein-Coupled Receptor (GPCR)
Mol. Mass.:
52868.96
Organism:
Homo sapiens (Human)
Description:
P21554
Residue:
472
  
Inhibitor
Name:
BDBM50265642
Synonyms:
CHEMBL498215 | N'-[(3Z)-1-(2-Cyclohexylethyl)-6-methoxy-2-oxo-1,2-dihydro-3H-indol-3-ylidene]benzohydrazide
Type:
Small organic molecule
Emp. Form.:
C24H27N3O3
Mol. Mass.:
405.4895
SMILES:
COc1ccc2C(=NNC(=O)c3ccccc3)C(=O)N(CCC3CCCCC3)c2c1
: