Target
Delta-type opioid receptor
Ligand
BDBM50252833
Substrate
Meas. Tech.
ChEMBL_534603 (CHEMBL989028)
EC50
190±n/a nM
Citation
 Le Bourdonnec, BWindh, RTAjello, CWLeister, LKGu, MChu, GHTuthill, PABarker, WMKoblish, MWiant, DDGraczyk, TMBelanger, SCassel, JAFeschenko, MSBrogdon, BLSmith, SAChrist, DDDerelanko, MJKutz, SLittle, PJDeHaven, RNDeHaven-Hudkins, DLDolle, RE Potent, orally bioavailable delta opioid receptor agonists for the treatment of pain: discovery of N,N-diethyl-4-(5-hydroxyspiro[chromene-2,4'-piperidine]-4-yl)benzamide (ADL5859). J Med Chem 51:5893-6 (2008)  
Target
Name:
Delta-type opioid receptor
Synonyms:
D-OR-1 Delta opioid receptor OPIATE Delta OPRD1 OPRK1 | opioid receptor, delta 1
Type:
G Protein-Coupled Receptor (GPCR)
Mol. Mass.:
40382.98
Organism:
Homo sapiens (Human)
Description:
Competition binding assays were carried out using membrane preparations from transfected HN9.10 cells that constitutively expressed the delta opioid receptor.
Residue:
372
  
Inhibitor
Name:
BDBM50252833
Synonyms:
4-(4-Methoxyphenyl)spiro[chromene-2,4'-piperidine] | CHEMBL495073
Type:
Small organic molecule
Emp. Form.:
C20H21NO2
Mol. Mass.:
307.3862
SMILES:
COc1ccc(cc1)C1=CC2(CCNCC2)Oc2ccccc12
: