Target
Glutamate receptor 3
Ligand
BDBM50060632
Substrate
Meas. Tech.
ChEMBL_539473 (CHEMBL1028969)
Ki
451±n/a nM
Citation
 Butini, SPickering, DSMorelli, ECoccone, SSTrotta, FDe Angelis, MGuarino, EFiorini, ICampiani, GNovellino, ESchousboe, AChristensen, JKGemma, S 1H-cyclopentapyrimidine-2,4(1H,3H)-dione-related ionotropic glutamate receptors ligands. structure-activity relationships and identification of potent and Selective iGluR5 modulators. J Med Chem 51:6614-8 (2008)  
Target
Name:
Glutamate receptor 3
Synonyms:
GRIA3_RAT Glutamate receptor 3 Glutamate-AMPA | Gria3
Type:
Enzyme Catalytic Domain
Mol. Mass.:
100383.57
Organism:
RAT
Description:
Glutamate-AMPA GRIA3 RAT::P19492
Residue:
888
  
Inhibitor
Name:
BDBM50060632
Synonyms:
(S)-2-Amino-3-(5-chloro-2,4-dioxo-3,4-dihydro-2H-pyrimidin-1-yl)-propionic acid CHEMBL121388
Type:
Small organic molecule
Emp. Form.:
C7H8ClN3O4
Mol. Mass.:
233.609
SMILES:
N[C@@H](Cn1cc(Cl)c(=O)[nH]c1=O)C(O)=O
: