Target
Glutamate receptor ionotropic, kainate 2
Ligand
BDBM50252923
Substrate
Meas. Tech.
ChEMBL_539476 (CHEMBL1028972)
Ki
>1000000±n/a nM
Citation
 Butini, SPickering, DSMorelli, ECoccone, SSTrotta, FDe Angelis, MGuarino, EFiorini, ICampiani, GNovellino, ESchousboe, AChristensen, JKGemma, S 1H-cyclopentapyrimidine-2,4(1H,3H)-dione-related ionotropic glutamate receptors ligands. structure-activity relationships and identification of potent and Selective iGluR5 modulators. J Med Chem 51:6614-8 (2008)  
Target
Name:
Glutamate receptor ionotropic, kainate 2
Synonyms:
GRIK2_RAT Glutamate receptor ionotropic kainate 2 Ionotropic glutamate receptor kainate 2/5
Type:
PROTEIN
Mol. Mass.:
102478.61
Organism:
Rattus norvegicus
Description:
ChEMBL_936439
Residue:
908
  
Inhibitor
Name:
BDBM50252923
Synonyms:
(S)-1-(2'-Amino-2'-carboxyethyl)quinazoline-2,4(1H,3H)-dione | CHEMBL508818
Type:
Small organic molecule
Emp. Form.:
C11H11N3O4
Mol. Mass.:
249.2227
SMILES:
N[C@@H](Cn1c2ccccc2c(=O)[nH]c1=O)C(O)=O
: