Target
Glutamate receptor ionotropic, kainate 2
Ligand
BDBM50060627
Substrate
Meas. Tech.
ChEMBL_539476 (CHEMBL1028972)
Ki
>100000±n/a nM
Citation
 Butini, SPickering, DSMorelli, ECoccone, SSTrotta, FDe Angelis, MGuarino, EFiorini, ICampiani, GNovellino, ESchousboe, AChristensen, JKGemma, S 1H-cyclopentapyrimidine-2,4(1H,3H)-dione-related ionotropic glutamate receptors ligands. structure-activity relationships and identification of potent and Selective iGluR5 modulators. J Med Chem 51:6614-8 (2008)  
Target
Name:
Glutamate receptor ionotropic, kainate 2
Synonyms:
GRIK2_RAT Glutamate receptor ionotropic kainate 2 Ionotropic glutamate receptor kainate 2/5
Type:
PROTEIN
Mol. Mass.:
102478.61
Organism:
Rattus norvegicus
Description:
ChEMBL_936439
Residue:
908
  
Inhibitor
Name:
BDBM50060627
Synonyms:
(S)-2-Amino-3-(5-iodo-2,4-dioxo-3,4-dihydro-2H-pyrimidin-1-yl)-propionic acid 2-AMINO-3-(5-IODO-2,4-DIOXO-3,4-DIHYDRO-2H-PYRIMIDIN-1-YL)-PROPIONIC ACID | CHEMBL121915
Type:
Small organic molecule
Emp. Form.:
C7H8IN3O4
Mol. Mass.:
325.0606
SMILES:
N[C@@H](Cn1cc(I)c(=O)[nH]c1=O)C(O)=O
: