Target
Glutamate receptor 4
Ligand
BDBM50107595
Substrate
Meas. Tech.
ChEMBL_539474 (CHEMBL1028970)
Ki
2090±n/a nM
Citation
 Butini, SPickering, DSMorelli, ECoccone, SSTrotta, FDe Angelis, MGuarino, EFiorini, ICampiani, GNovellino, ESchousboe, AChristensen, JKGemma, S 1H-cyclopentapyrimidine-2,4(1H,3H)-dione-related ionotropic glutamate receptors ligands. structure-activity relationships and identification of potent and Selective iGluR5 modulators. J Med Chem 51:6614-8 (2008)  
Target
Name:
Glutamate receptor 4
Synonyms:
GRIA4_RAT Glutamate receptor ionotropic, AMPA 4 Gria4
Type:
PROTEIN
Mol. Mass.:
100766.57
Organism:
Rattus norvegicus
Description:
ChEMBL_539474
Residue:
902
  
Inhibitor
Name:
BDBM50107595
Synonyms:
(S)-1-(2-Amino-2-carboxyethyl)-6,7-dihydro-1H-cyclopenta[d]-pyrimidin-2,4(1H,3H)dione 2-Amino-3-(2,4-dioxo-2,3,4,5,6,7-hexahydro-cyclopentapyrimidin-1-yl)-propionic acid | CHEMBL337577
Type:
Small organic molecule
Emp. Form.:
C10H13N3O4
Mol. Mass.:
239.2279
SMILES:
N[C@@H](Cn1c2CCCc2c(=O)[nH]c1=O)C(O)=O
: