Target
Glutamate receptor 2
Ligand
BDBM50107595
Substrate
Meas. Tech.
ChEMBL_539479 (CHEMBL1029764)
EC50
13900±n/a nM
Citation
 Butini, SPickering, DSMorelli, ECoccone, SSTrotta, FDe Angelis, MGuarino, EFiorini, ICampiani, GNovellino, ESchousboe, AChristensen, JKGemma, S 1H-cyclopentapyrimidine-2,4(1H,3H)-dione-related ionotropic glutamate receptors ligands. structure-activity relationships and identification of potent and Selective iGluR5 modulators. J Med Chem 51:6614-8 (2008)  
Target
Name:
Glutamate receptor 2
Synonyms:
GRIA2_RAT Glutamate receptor AMPA 2/4 Gria2
Type:
PROTEIN
Mol. Mass.:
98691.74
Organism:
Rattus norvegicus
Description:
ChEMBL_936441
Residue:
883
  
Inhibitor
Name:
BDBM50107595
Synonyms:
(S)-1-(2-Amino-2-carboxyethyl)-6,7-dihydro-1H-cyclopenta[d]-pyrimidin-2,4(1H,3H)dione 2-Amino-3-(2,4-dioxo-2,3,4,5,6,7-hexahydro-cyclopentapyrimidin-1-yl)-propionic acid | CHEMBL337577
Type:
Small organic molecule
Emp. Form.:
C10H13N3O4
Mol. Mass.:
239.2279
SMILES:
N[C@@H](Cn1c2CCCc2c(=O)[nH]c1=O)C(O)=O
: