Target
Glutamate receptor 3
Ligand
BDBM50252920
Substrate
Meas. Tech.
ChEMBL_539482 (CHEMBL1029767)
EC50
33900±n/a nM
Citation
 Butini, SPickering, DSMorelli, ECoccone, SSTrotta, FDe Angelis, MGuarino, EFiorini, ICampiani, GNovellino, ESchousboe, AChristensen, JKGemma, S 1H-cyclopentapyrimidine-2,4(1H,3H)-dione-related ionotropic glutamate receptors ligands. structure-activity relationships and identification of potent and Selective iGluR5 modulators. J Med Chem 51:6614-8 (2008)  
Target
Name:
Glutamate receptor 3
Synonyms:
GRIA3_RAT Glutamate receptor 3 Glutamate-AMPA | Gria3
Type:
Enzyme Catalytic Domain
Mol. Mass.:
100383.57
Organism:
RAT
Description:
Glutamate-AMPA GRIA3 RAT::P19492
Residue:
888
  
Inhibitor
Name:
BDBM50252920
Synonyms:
(S)-1-[2'-Amino-2'-carboxyethyl]-5,7-dihydrothieno[3,4-d]pyrimidin-2,4(1H,3H)-dione | CHEMBL492469
Type:
Small organic molecule
Emp. Form.:
C9H11N3O4S
Mol. Mass.:
257.266
SMILES:
N[C@@H](Cn1c2CSCc2c(=O)[nH]c1=O)C(O)=O
: