Target
Glutamate receptor 1
Ligand
BDBM17661
Substrate
Meas. Tech.
ChEMBL_539477 (CHEMBL1028973)
EC50
11500±n/a nM
Citation
 Butini, SPickering, DSMorelli, ECoccone, SSTrotta, FDe Angelis, MGuarino, EFiorini, ICampiani, GNovellino, ESchousboe, AChristensen, JKGemma, S 1H-cyclopentapyrimidine-2,4(1H,3H)-dione-related ionotropic glutamate receptors ligands. structure-activity relationships and identification of potent and Selective iGluR5 modulators. J Med Chem 51:6614-8 (2008)  
Target
Name:
Glutamate receptor 1
Synonyms:
AMPA-selective glutamate receptor 1 GluA1 GluR-A Glur1 Gria1
Type:
Protein
Mol. Mass.:
101583.91
Organism:
Rattus norvegicus (Rat)
Description:
P19490
Residue:
907
  
Inhibitor
Name:
BDBM17661
Synonyms:
(2S)-2-amino-3-(2,4-dioxo-1,2,3,4-tetrahydropyrimidin-1-yl)propanoic acid CHEMBL122005 | willardiine
Type:
Small organic molecule
Emp. Form.:
C7H9N3O4
Mol. Mass.:
199.1641
SMILES:
N[C@@H](Cn1ccc(=O)[nH]c1=O)C(O)=O
: