Target
Peroxisome proliferator-activated receptor gamma
Ligand
BDBM50264539
Substrate
Meas. Tech.
ChEMBL_539582 (CHEMBL1035757)
EC50
41400±n/a nM
Citation
 Suh, YGKim, NJKoo, BWLee, KOMoon, SHShin, DHJung, JWPaek, SMChang, DJLi, FKang, HJLe, TVChae, YNShin, CYKim, MKLim, JIRyu, JSPark, HJ Design, synthesis, and biological evaluation of novel constrained meta-substituted phenyl propanoic acids as peroxisome proliferator-activated receptor alpha and gamma dual agonists. J Med Chem 51:6318-33 (2008)  
Target
Name:
Peroxisome proliferator-activated receptor gamma
Synonyms:
NR1C3 PPAR-gamma PPARG_HUMAN Peroxisome proliferator-activated receptor gamma (PPAR gamma) Peroxisome proliferator-activated receptor gamma (PPARĪ³) peroxisome proliferator-activated receptor gamma isoform 2
Type:
Nuclear Receptor
Mol. Mass.:
57613.46
Organism:
Homo sapiens (Human)
Description:
P37231
Residue:
505
  
Inhibitor
Name:
BDBM50264539
Synonyms:
(R)-3-(3-(5-Benzyl-4,5-dihydroisoxazol-3-yl)phenyl)-2-ethoxypropanoicAcid | CHEMBL484264
Type:
Small organic molecule
Emp. Form.:
C21H23NO4
Mol. Mass.:
353.4116
SMILES:
CCO[C@H](Cc1cccc(c1)C1=NOC(Cc2ccccc2)C1)C(O)=O
: