Target
Neuronal acetylcholine receptor subunit alpha-7
Ligand
BDBM50254538
Substrate
Meas. Tech.
ChEMBL_494699 (CHEMBL938658)
Ki
>1000000±n/a nM
Citation
 Hansen, CPJensen, AAChristensen, JKBalle, TLiljefors, TFrølund, B Novel acetylcholine and carbamoylcholine analogues: development of a functionally selective alpha4beta2 nicotinic acetylcholine receptor agonist. J Med Chem 51:7380-95 (2009)  
Target
Name:
Neuronal acetylcholine receptor subunit alpha-7
Synonyms:
ACHA7_RAT Cholinergic, Nicotinic Alpha7 Chrna7 Neuronal acetylcholine receptor (alpha7 nAChR) Neuronal acetylcholine receptor subunit alpha-7 Neuronal acetylcholine receptor subunit alpha-7 (nAChR)
Type:
Enzyme
Mol. Mass.:
56502.44
Organism:
Rattus norvegicus (Rat)
Description:
Q05941
Residue:
502
  
Inhibitor
Name:
BDBM50254538
Synonyms:
3-(dimethylamino)butyl methylcarbamate | CHEMBL466400
Type:
Small organic molecule
Emp. Form.:
C8H18N2O2
Mol. Mass.:
174.2407
SMILES:
CNC(=O)OCCC(C)N(C)C
: