Target
Sigma non-opioid intracellular receptor 1
Ligand
BDBM50274948
Substrate
Meas. Tech.
ChEMBL_496151 (CHEMBL1000140)
Ki
>6000±n/a nM
Citation
 Berardi, FAbate, CFerorelli, Sde Robertis, AFLeopoldo, MColabufo, NANiso, MPerrone, R Novel 4-(4-aryl)cyclohexyl-1-(2-pyridyl)piperazines as Delta(8)-Delta(7) sterol isomerase (emopamil binding protein) selective ligands with antiproliferative activity. J Med Chem 51:7523-31 (2009)  
Target
Name:
Sigma non-opioid intracellular receptor 1
Synonyms:
OPRS1 SIGMAR1 Sigma non-opioid intracellular receptor 1 Sigma1-receptor Sterol isomerase-like protein
Type:
Protein
Mol. Mass.:
25307.17
Organism:
Cavia porcellus (Guinea pig)
Description:
Q60492
Residue:
223
  
Inhibitor
Name:
BDBM50274948
Synonyms:
CHEMBL457722 | cis-4-[4-(2,6-Dimethoxyphenyl)cyclohexyl]-1-(2-pyridinyl)piperazine
Type:
Small organic molecule
Emp. Form.:
C23H31N3O2
Mol. Mass.:
381.5111
SMILES:
COc1cccc(OC)c1[C@@H]1CC[C@@H](CC1)N1CCN(CC1)c1ccccn1
: