Target
ATP-binding cassette sub-family C member 9
Ligand
BDBM50247710
Substrate
Meas. Tech.
ChEMBL_495672 (CHEMBL1006149)
EC50
1540±n/a nM
Citation
 Zhang, XQiu, YLi, XBhattacharjee, SWoods, MKraft, PLundeen, SGSui, Z Discovery and structure-activity relationships of a novel series of benzopyran-based K(ATP) openers for urge urinary incontinence. Bioorg Med Chem 17:855-66 (2009)  
Target
Name:
ATP-binding cassette sub-family C member 9
Synonyms:
ABCC9 ATP-binding cassette transporter sub-family C member 9 Sulfonylurea receptor 2 | Sulfonylurea receptor 2, Kir6.2
Type:
PROTEIN
Mol. Mass.:
174236.59
Organism:
Homo sapiens (Human)
Description:
ChEMBL_495672
Residue:
1549
  
Inhibitor
Name:
BDBM50247710
Synonyms:
3-chloro-N-((3S,4R)-6-cyano-3-hydroxy-2,2-dimethylchroman-4-yl)benzenesulfonamide | CHEMBL454169
Type:
Small organic molecule
Emp. Form.:
C18H17ClN2O4S
Mol. Mass.:
392.857
SMILES:
CC1(C)Oc2ccc(cc2[C@@H](NS(=O)(=O)c2cccc(Cl)c2)[C@@H]1O)C#N
: